Fedora RISC-V tracker

Jump to: statistics, data, information.

PackageStatusPRFedora RISC-V buildFedora buildCentOS Stream buildNotes
GENieDONE#11187^20241207.93f6621-8.fc45🗐 1187^20241207.93f6621-8.fc45
InsightToolkit ⚠DONE#104.13.3-33.fc44🗐 5.4.6-3.fc45
RTRIAGED🗐 4.6.1-2.0.riscv64.fc45🗐 4.6.1-2.fc45disabled testsuite
R-bench ⚠TRIAGED🗐 1.1.2-12.0.riscv64.fc42🗐 1.1.4-6.fc45disabled testsuite
R-dplyr ⚠TRIAGED🗐 1.1.4-6.1.riscv64.fc42🗐 1.2.1-2.fc45disabled testsuite
R-lubridateTRIAGED🗐 1.9.4-12.0.riscv64.fc45🗐 1.9.4-10.fc45disabled testsuite
R-rlang ⚠TRIAGED🗐 1.2.0-5.0.riscv64.fc44🗐 1.2.0-5.fc45disabled testsuite
R-rpm-macros ⚠NEW🗐 1.3.7-4.0.riscv64.fc44🗐 1.3.7-3.fc45
Simple-FuzzerDONE#10.7.1-25.fc43🗐 0.7.1-25.fc43
SingularTRIAGED🗐 4.4.1p5-6.1.riscv64.fc45~bootstrap🗐 4.4.1p5-5.fc45bootstrapping
abrtDONE#432.17.9-1.fc45🗐 2.17.9-1.fc45
aemuDONE#10.1.2^20231031gitdd8b929c-10.fc45🗐 0.1.2^20231031gitdd8b929c-10.fc45
alizams ⚠DONE#11.9.10-10.fc44🗐 1.10.3-1.fc45
anacondaNEW🗐 45.22-1.0.riscv64.fc45🗐 45.27-2.fc45🗐 40.22.3.57-1.el10
apptainer ⚠DONE#51.4.5-2.fc43🗐 1.5.4-1.fc45
atlasDONE#33.10.3-35.fc45🗐 3.10.3-33.fc45
aurynDONE#60.8.4-7.fc45🗐 0.8.4-7.fc45
bcalDONE#22.5-2.fc45🗐 2.5-2.fc45
bind9-nextDONE#169.21.22-4.fc45🗐 9.21.22-5.fc45
bpftrace ⚠DONE#90.24.2-1.fc43🗐 0.26.1-2.fc45🗐 0.26.1-1.el10crashes in tests
calibreDONE#229.13.0-1.fc45🗐 9.14.0-3.fc45
catchDONE#73.16.0-3.fc45🗐 3.16.0-3.fc45empty debugsourcefiles.list
clamavDONE#281.4.6-1.fc45🗐 1.4.6-2.fc45
clang15 ⚠NEW🗐 15.0.7-8.0.riscv64.fc42🗐 15.0.7-13.fc45
clang18 ⚠POST#8🗐 18.1.8-5.0.riscv64.fc41🗐 18.1.8-11.fc455 tests fail: Clang :: Modules/embed-files-compressed.cpp Clang :: OpenMP/declare_variant_device_isa_codegen_1.c Clang Tools :: clang-query/invalid-command-line.cpp Clang Tools :: clang-tidy/infrastructure/invalid-command-line.cpp Clangd :: log.test
cmakeTRIAGED🗐 4.3.0-4.1.riscv64.fc45🗐 4.3.0-5.fc45🗐 3.31.8-1.el10Few failing tests on real hw, huge amount of timeouts on emulated one.
compat-luaDONE#15.1.5-32.fc45🗐 5.1.5-32.fc45
cp2kDONE#132026.2-4.fc45🗐 2026.2-4.fc45
cpuinfoDONE#125.11.14-1.gitf858c30.fc45.1🗐 25.11.14-1.gitf858c30.fc45.1
crashDONE#169.0.2-2.fc45🗐 9.0.2-2.fc45🗐 9.0.2-1.el10
crash-trace-commandDONE#13.0-17.fc45🗐 3.0-17.fc45🗐 3.0-15.el10
criuDONE#144.2.1-2.fc45🗐 4.2.1-2.fc45🗐 4.2-9.el10
crunDONE#701.29.1-1.fc45🗐 1.29.1-1.fc45🗐 1.30.1-1.el10
cryptlibDONE#53.4.9.3-5.rvre0.fc45🗐 3.4.9.3-5.fc45
dmidecodeDONE#113.7-2.fc45🗐 3.7-2.fc45🗐 3.6-5.el10
dmtcpDONE#44.2.0-3.fc45🗐 4.2.0-3.fc45
dpdkDONE#624.11.4-3.fc45🗐 24.11.4-3.fc45🗐 25.11-1.el10
efi-rpm-macrosDONE#76-9.fc45🗐 6-9.fc45🗐 6-8.el10
elixir ⚠DONE#91.19.5-4.fc43🗐 1.20.4-1.fc45needed increasing timeouts for some testcases
execstackDONE#10.5.0-33.fc45🗐 0.5.0-33.fc45🗐 0.5.0-31.el10
f2cDONE#120210928-14.fc45🗐 20210928-14.fc45
fabtestsDONE#42.5.1-3.fc45🗐 2.5.1-3.fc45🗐 2.5.1-1.el10
fastnetmonMERGED#7🗐 1.2.9-3.0.riscv64.fc45🗐 1.2.9-2.fc45fixed FTFBS
fedora-reposTRIAGED🗐 45-0.5.2.riscv64🗐 45-0.6Changes can be dropped once we're on Fedora infra
ffmpegDONE#498.1.2-12.fc45🗐 9.0.2-2.fc45
fftwDONE#123.3.10-18.fc45🗐 3.3.10-18.fc45🗐 3.3.11-1.el10
filesystemDONE#183.18-59.fc45🗐 3.18-59.fc45🗐 3.18-17.el10
fips-providerNEW🗐 1.5.2-4.0.riscv64.fc45🗐 1.5.2-3.fc45
firefoxDONE#76154.0-5.fc45🗐 157.0-1.fc45🗐 140.16.0-1.el10
flatpakNEW🗐 1.18.0-3.0.riscv64.fc45🗐 1.19.0^really1.18.4-1.fc45🗐 1.18.0-2.el10
fpc ⚠TRIAGED🗐 3.3.1-2.0.riscv64.fc30🗐 3.2.4~rc2-1.fc45needs bootstrapping
fwupdDONE#132.1.7-1.fc45🗐 2.1.8-1.fc45🗐 2.1.6-1.el10
gambas3DONE#53.21.6-3.fc45🗐 3.22.1-2.fc45
gammuDONE#31.42.0-23.fc45🗐 1.42.0-23.fc45
gdDONE#92.3.3-22.fc45🗐 2.3.3-22.fc45🗐 2.3.3-22.el10
gdl ⚠DONE#171.1.1-5.fc43🗐 1.1.3-5.fc45
ghc-cryptonDONE#11.0.5-2.fc45🗐 1.0.5-2.fc45
ghc-crypton-x509-validationDONE#11.6.14-8.fc45🗐 1.6.14-8.fc45
ghc9.2 ⚠TRIAGED🗐 9.2.8-18.2.riscv64.fc38🗐 9.2.8-34.fc45Blocked by debugedit issue '/usr/bin/debugedit Cannot handle 8-byte build ID'
glibcDONE#1382.44-1.fc45🗐 2.44-1.fc45🗐 2.39-141.el10
gnat-srpm-macrosDONE#27-3.fc45🗐 7-3.fc45
gnu-efiDONE#93.0.18-17.fc45🗐 3.0.18-17.fc45🗐 3.0.18-4.el10
godot3DONE#33.6.2-3.fc45🗐 3.6.2-3.fc45
golangDONE#2711.27.0-3.fc45🗐 1.27.1-2.fc45🗐 1.26.7-1.el10
golang-x-mobileDONE#40-0.34.20260720git6129f5b.fc45🗐 0-0.34.20260720git6129f5b.fc45
golang-x-tools ⚠TRIAGED🗐 0.36.0-4.0.riscv64.fc43🗐 0.45.0-2.fc45increased timeout for tests
gprconfig-kbDONE#626.0.0-4.fc45🗐 26.0.0-4.fc45
grantlee-qt5DONE#15.3.1-11.fc45🗐 5.3.1-11.fc45
grub2DONE#1202.12-77.fc45🗐 2.12-81.fc45🗐 2.12-57.el10Basic support merged, need to consider further improvements
grubbyDONE#218.40-91.fc45🗐 8.40-91.fc45🗐 8.40-86.el10
gstreamer1-plugins-bad-freeDONE#281.28.6-1.fc45🗐 1.28.7-2.fc45🗐 1.26.7-9.el10disabled onnx, two PR - rawhide and F43
gtk2DONE#132.24.33-28.fc45🗐 2.24.33-28.fc45
guile22DONE#12.2.7-18.fc45🗐 2.2.7-18.fc43
heaptrackDONE#31.5.0-13.fc45🗐 1.5.0-13.fc45
hylafax+DONE#17.0.11-8.fc45🗐 7.0.11-8.fc45
hyprutilsDONE#30.7.1-4.fc43🗐 0.7.1-4.fc43
iyfctDONE#11.0.2-20180819git.ac4555d.fc45.20🗐 1.0.2-20180819git.ac4555d.fc45.20
java-25-openjdk ⚠NEW🗐 25.0.1.0.8-1.0.riscv64.fc42🗐 25.0.4.1.1-1.1.fc45🗐 25.0.4.1.1-2.1.el10
java-25-openjdk-portable ⚠NEW🗐 25.0.1.0.8-1.0.riscv64.fc42🗐 25.0.4.0.7-2.0.fc43
java-latest-openjdk-portable ⚠NEW🗐 26.0.1.0.8-1.rolling.0.riscv64.fc44🗐 26.0.2.0.10-0.rolling.fc43
jitterentropy ⚠DONE#13.6.0-4.fc44🗐 3.7.0-4.fc45🗐 3.7.0-1.el10
juliusDONE#24.6-12.fc45🗐 4.6-12.fc45
kdelibs3POST#5🗐 3.5.10-137.0.riscv64.fc45🗐 3.5.10-138.fc45
keaDONE#193.2.0-3.fc45🗐 3.2.0-4.fc45🗐 3.0.3-1.el10
kernelTRIAGED🗐 7.2.7-300.0.riscv64.fc45🗐 7.2.9-300.fc45🗐 6.12.0-273.el10Most changes merged, configs need constant updates
kxstitchDONE#22.2.0-11.fc45🗐 2.2.0-11.fc45
libEMFDONE#31.0.14-2.fc45🗐 1.0.14-2.fc45
libasyncnsDONE#30.8-35.fc45🗐 0.8-35.fc45🗐 0.8-30.el10
libayatana-appindicatorDONE#20.5.94-7.fc45🗐 0.6.0-1.fc45no Mono
libepoxyDONE#21.5.10-13.fc45🗐 1.5.10-13.fc45🗐 1.5.10-10.el10
libffiDONE#163.5.2-3.fc45🗐 3.5.2-3.fc45🗐 3.4.4-10.el10
libfreenectDONE#30.7.5-10.fc45🗐 0.7.5-10.fc45
libgcryptDONE#111.12.2-2.fc45🗐 1.12.2-2.fc45🗐 1.11.0-7.el10fails with: MAYB: test: gaps, reason: not all of the .text section is covered by notes. Also needs LTO to be enabled
libipuzDONE#70.5.4-5.fc45🗐 0.5.4-5.fc45increased timeout for testsuite
libmusicbrainz5DONE#55.1.0-31.fc45🗐 5.1.0-32.fc45
libomemo-cDONE#20.5.1-6.fc45🗐 0.5.1-6.fc45
libratbagDONE#30.18-6.fc45🗐 0.18-6.fc45
libreoffice ⚠NEW🗐 24.8.3.2-3.0.riscv64.fc42🗐 26.8.1.1-0.2.fc45
libstoragemgmtDONE#71.10.3-4.fc45🗐 1.10.3-4.fc45🗐 1.10.1-4.el10
libtoolDONE#112.5.4-11.fc45🗐 2.5.4-11.fc45🗐 2.4.7-14.el10
libunicodeDONE#20.9.0-2.fc45🗐 0.9.0-2.fc45
libunwindDONE#101.8.3-1.fc45🗐 1.8.3-4.fc45
libvirtDONE#3012.6.0-1.fc45🗐 12.6.0-2.fc45🗐 12.8.0-1.el10
llvmMERGED#408🗐 22.1.8-22.0.riscv64.fc45🗐 23.1.2-2.fc45🗐 22.1.8-1.el10several 'run tests || true' calls and fails with 'offset is outside the section' linker error
llvm15DONE#415.0.7-17.fc45🗐 15.0.7-17.fc45lowering memory usage like on some other architectures
llvm19 ⚠MERGED#6🗐 19.1.7-12.0.riscv64.fc42🗐 19.1.7-18.fc45
llvm20 ⚠NEW🗐 20.1.8-5.2.riscv64.fc43🗐 20.1.8-13.fc45
llvm21NEW🗐 21.1.8-10.0.riscv64.fc45🗐 21.1.8-10.fc45
luajit ⚠TRIAGED🗐 2.1.1767980792-5.0.riscv64.fc43🗐 2.1.1767980792-2.fc45support taken from GitHub PR
lusol ⚠TRIAGED🗐 20160126-7.0.riscv64.20221005gite35b66d.fc43🗐 20160126-9.20221005gite35b66d.fc45LTO stuff
mariadb10.11DONE#2610.11.18-3.fc45🗐 10.11.18-4.fc45🗐 10.11.18-1.el10Fix sent to upstream and Fedora, requires disabling/ignoring test suite
mariadb11.8DONE#1011.8.8-100.fc45🗐 11.8.8-101.fc45🗐 11.8.8-1.el10Fix sent to upstream and Fedora, requires disabling/ignoring test suite
mesa-compatDONE#625.0.7-9.fc45🗐 25.0.7-9.fc45🗐 25.0.7-4.el10
mokutilDONE#70.7.2-7.fc45🗐 0.7.2-7.fc45🗐 0.7.2-8.el10
mozjs128TRIAGED🗐 128.14.0-1.0.riscv64.fc45🗐 128.14.0-4.fc45we remove -fexceptions
mozjs140TRIAGED🗐 140.13.0-4.0.riscv64.fc45🗐 140.13.0-3.fc45we remove -fexceptions, lto, tests
mpichDONE#174.2.2-10.fc45🗐 4.2.2-10.fc45🗐 4.1.2-15.el10
mysql8.4TRIAGED🗐 8.4.10-2.2.riscv64.fc45🗐 8.4.11-1.fc45🗐 8.4.11-1.el10requires disabling/ignoring test suite
nclTRIAGED🗐 6.6.2-66.0.riscv64.fc45🗐 6.6.2-65.fc45Builds fine once patched, crashes immediately at runtime
nodejs22DONE#122.23.1-4.fc45🗐 22.23.1-4.fc45🗐 22.23.2-1.el10
nss-pemDONE#11.1.1-5.fc45🗐 1.1.1-5.fc45
ntlDONE#111.6.0-6.fc45🗐 11.6.0-7.fc45
nutDONE#222.8.5-7.fc45🗐 2.8.5-8.fc45
nvidia-texture-toolsDONE#12.1.2-17.fc45🗐 2.1.2-17.fc45
obs-studioDONE#932.1.1-6.fc45🗐 32.2.2-3.fc45
onnxDONE#101.21.0-5.fc45🗐 1.21.0-5.fc453 tests fail, may need to be sorted out upstream
openbabelDONE#63.2.0-7.rvre0.fc45🗐 3.2.0-7.fc45
openblasDONE#150.3.34-1.fc45🗐 0.3.34-1.fc45🗐 0.3.33-1.el10
openblas-srpm-macrosDONE#22-22.fc45🗐 2-22.fc45🗐 2-19.el10
opencvNEW🗐 4.13.0-10.0.riscv64.fc45🗐 4.13.0-11.fc45
openexr2DONE#32.5.10-2.fc45🗐 2.5.10-2.fc45
openscadDONE#242021.01-32.fc45🗐 2021.01-33.fc45
opensslDONE#544.0.1-5.fc45🗐 4.0.3-1.fc45🗐 3.5.8-1.el10
opensurge ⚠TRIAGED🗐 0.6.1.3-1.0.riscv64.fc43🗐 0.6.1.3-2.fc45empty debugsourcefiles.list
orthorobotDONE#11.1.1-27.fc45🗐 1.1.1-27.fc45
os-autoinst ⚠MERGED#2🗐 4.6^20241125gitb64e219-3.0.riscv64.fc42🗐 5^20260601git6ee8da2-5.fc45needs perl-Mojo-IOLoop-ReadWriteProcess changes
pcpDONE#287.2.1-1.fc45🗐 7.2.1-1.fc45🗐 7.1.5-6.el10
perl-Mojo-IOLoop-ReadWriteProcessDONE#11.1.0-4.fc45🗐 1.1.0-4.fc45
pesignDONE#3116-9.fc45🗐 116-9.fc45🗐 117-1.el10
petscDONE#103.25.4-1.fc45🗐 3.25.5-3.fc45
pgadmin4 ⚠TRIAGED🗐 9.3-1.0.riscv64.fc42🗐 9.18-1.fc45empty debugsourcefiles.list
php-pecl-httpPOST#1🗐 4.3.1-5.1.riscv64.fc45🗐 4.3.1-6.fc45has one test dropped due to timeout on current builders
plplotDONE#165.15.0-114.rvre0.fc45🗐 5.15.0-117.fc45disabled ocaml tests (like on ppc*)
premakeDONE#25.0.0-11.20251127gite38ef3f.fc45🗐 5.0.0-12.20270905gitddab06a.fc45
protobuf3TRIAGED🗐 3.19.6-50.0.riscv64.fc45🗐 3.19.6-66.fc45disable MinGW for now
pungi ⚠TRIAGED🗐 4.10.1-3.0.riscv64.fc43🗐 4.14.0-2.fc45Fix sent upstream https://pagure.io/pungi/pull-request/1886
python-astropy ⚠DONE#177.0.1-2.fc43🗐 8.0.1-3.fc45
python-dbus-fastTRIAGED🗐 5.0.9-5.0.riscv64.fc45🗐 5.0.9-4.fc45empty debugsourcefiles.list
python-greenletDONE#163.5.5-1.fc45🗐 3.5.5-1.fc45🗐 3.0.3-5.el10
python-jniusDONE#41.7.0-4.fc45🗐 1.7.0-4.fc45
python-matplotlibTRIAGED🗐 3.11.1-4.0.riscv64.fc45🗐 3.11.1-2.fc45disabled testsuite
python-mplcairo ⚠TRIAGED🗐 0.6.1-8.0.riscv64.fc43🗐 0.6.1-10.fc45disabled testsuite - 14 tests failed: FAILED matplotlib/tests/test_dates.py::test_auto_date_locator_intmult_tz FAILED matplotlib/tests/test_axes.py::test_pcolornearestunits[png] FAILED matplotlib/tests/test_font_manager.py::test_fontcache_thread_safe FAILED matplotlib/tests/test_backend_pgf.py::test_rcupdate FAILED matplotlib/tests/test_ticker.py::TestAsinhLocator::test_linear_values FAILED matplotlib/tests/test_ticker.py::TestAsinhLocator::test_near_zero FAILED matplotlib/tests/test_ticker.py::TestAsinhLocator::test_base_rounding FAILED matplotlib/tests/test_ticker.py::TestAsinhLocator::test_wide_values FAILED matplotlib/tests/test_ticker.py::TestAsinhLocator::test_symmetrizing FAILED matplotlib/tests/test_ticker.py::test_minorticks_toggle FAILED matplotlib/tests/test_sphinxext.py::test_tinypages FAILED matplotlib/tests/test_sphinxext.py::test_srcset_version FAILED matplotlib/tests/test_determinism.py::test_determinism_check[mhip-ps-True] FAILED matplotlib/tests/test_determinism.py::test_determinism_check[mhip-svg-True]
python-psutilDONE#307.2.2-10.fc45🗐 7.2.2-10.fc45🗐 5.9.8-6.el10
python-psycopg3DONE#133.3.4-8.fc45🗐 3.3.6-2.fc45
python-python-fclDONE#10.7.0.11-6.fc45🗐 0.7.0.11-6.fc45
python-ssh-pythonTRIAGED🗐 1.1.1-11.0.riscv64.fc45🗐 1.1.1-11.fc45empty debugsourcefiles.list
python-zeroconfTRIAGED🗐 0.149.17-4.0.riscv64.fc45🗐 0.150.5-1.fc45empty debugsourcefiles.list
python-zmqDONE#2727.2.0-1.fc45🗐 27.2.0-1.fc45
qemuDONE#7211.1.0-0.2.rc3.fc45🗐 11.1.2-1.fc45
qt ⚠DONE#74.8.7-85.fc44🗐 4.8.7-84.fc45
qt5-qtwebengineDONE#205.15.19-9.fc45🗐 5.15.19-10.fc45
qt6DONE#86.11.1-2.fc45🗐 6.11.2-1.fc45🗐 6.10.1-1.el10
qt6-qtshadertoolsDONE#36.11.1-2.fc45🗐 6.11.2-1.fc45🗐 6.10.1-2.el10
qt6-qtwebengine ⚠TRIAGED🗐 6.11.1-1.0.riscv64.fc44🗐 6.11.2-4.fc45RISC-V patches from OpenSUSE
rdma-coreDONE#1664.0-3.fc45🗐 64.0-3.fc45🗐 62.0-3.el10
redhat-rpm-configMERGED#357🗐 344-7.0.riscv64.fc45🗐 345-4.fc45🗐 296-1.el10compiler flags differences: -fstack-clash-protection enabled
renderdocPOST#5🗐 1.45-3.0.riscv64.fc45🗐 1.45-3.fc45
roc-toolkitDONE#30.4.0-7.fc45🗐 0.4.0-7.fc45
rootPOST#10🗐 6.40.02-4.1.riscv64.fc45🗐 6.40.04-2.fc45
rpm-head-signingDONE#121.7.6-5.fc45🗐 1.7.6-5.fc45
rpyDONE#43.5.16-17.fc45🗐 3.5.16-17.fc45
rubyDONE#1954.0.6-37.fc45🗐 4.0.7-39.fc45🗐 3.3.12-15.el10
safetyblanketDONE#11.01-23.fc45🗐 1.01-23.fc45
sambaDONE#424.24.5-1.fc45🗐 4.25.0-3.fc45🗐 4.24.5-101.el10
samtoolsDONE#61.24-2.fc45🗐 1.24-2.fc45
sbclDONE#22.6.6-1.fc45🗐 2.6.9-1.fc45
sbsigntoolsDONE#60.9.5-16.fc45🗐 0.9.5-16.fc45
scipyTRIAGED🗐 1.16.2-7.0.riscv64.fc45🗐 1.18.0-1.fc45🗐 1.11.3-17.el10Blocked by debugedit issue '/usr/bin/debugedit Bad string pointer index'
sedDONE#54.10-2.fc45🗐 4.10-2.fc45🗐 4.9-5.el10
snapshotDONE#351~beta-1.fc45🗐 51.0-2.fc45🗐 46.3-1.el10
softhsmDONE#112.7.0-2.fc45🗐 2.7.0-2.fc45🗐 2.6.1-16.el10
sssdDONE#652.13.1-6.fc45🗐 2.13.1-7.fc45🗐 2.13.1-3.el10
stalldDONE#21.28.1-2.fc45🗐 1.28.1-2.fc45🗐 1.26.3-1.el10
star ⚠DONE#31.6-18.fc43🗐 2024.03.21-7.fc45🗐 1.6-20.el102024.03.21 version needs some love
surgescript ⚠TRIAGED🗐 0.6.1-2.0.riscv64.fc42🗐 0.6.1-6.fc45empty debugsourcefiles.list
sympyDONE#61.14.0-17.fc45🗐 1.14.0-17.fc45
systemdDONE#235261.2-1.fc45🗐 262-3.fc45🗐 257-34.el10
systemd-bootchartDONE#2235-5.fc45🗐 235-5.fc45
tachyonDONE#20.99.5-6.fc45🗐 0.99.5-6.fc45
tlpiDONE#1260523-2.fc45🗐 260523-2.fc45
toolboxTRIAGED🗐 0.3-5.0.riscv64.fc45🗐 0.3-7.fc45🗐 0.3-3.el10empty debugsourcefiles.list
uboot-tools ⚠MERGED#22🗐 2026.01-3.0.riscv64.fc43🗐 2026.10-0.4.rc4.fc45Basic support merged, board configs need upstream work
ucxDONE#71.19.0-3.fc45🗐 1.19.0-3.fc45🗐 1.20.1-1.el10
umrDONE#21.0.11-4.fc45🗐 1.0.11-4.fc45
ursa-majorDONE#60.5.1-12.fc45🗐 0.5.1-12.fc45
viprDONE#11.1^20251029.30f2951-5.fc45🗐 1.1^20251029.30f2951-6.fc45
vxl ⚠DONE#42.0.2-30.fc41🗐 3.5.0-20.fc45fixed FTFBS
wasmedgeDONE#70.17.1-2.fc45🗐 0.17.1-2.fc45
webkitgtkTRIAGED🗐 2.53.4-4.1.riscv64.fc45🗐 2.54.1-1.fc45https://bugs.webkit.org/show_bug.cgi?id=271371 shows that it is complicated package
workflow ⚠DONE#50.11.8-1.fc42🗐 0.11.11-2.fc44
xarDONE#21.8.0.417.1-20.fc45🗐 1.8.0.417.1-21.fc45
zlib-ngDONE#532.3.3-6.fc45🗐 2.3.3-6.fc45🗐 2.2.3-3.el10

Statistics

All packages55 CentOS Stream packages10
NEW12 NEW3
TRIAGED32 TRIAGED5
POST5 POST0
MERGED6 MERGED2

These figures only include packages that still need work or attention.

Data

The data presented in the table above is also available for download in CSV format.

Information

This page tracks the progress of upstreaming changes from the Fedora RISC-V overlay to Fedora sources.

Status can be one of the following:

Packages marked with ⚠ are those for which the RISC-V build was carried over from a previous version of Fedora.

The source code, along with instructions on how to contribute information about packages, can be found at gitlab.com/abologna/fedora-riscv-tracker

Updated daily. Last update: Tuesday, 06 October 2026 at 02:05